{"text_format":"1","workbook":"xlsx","n_sheets":10,"sheets":["À LIRE EN PREMIER","Inputs","Résultats","Impact","Données de couverture","Country Data","Données sur le taux de perte","Coûts programmatiques","Données sur le produit","Co-financement Gavi"],"not_rendered":{"charts":5,"images":2,"macros":1,"external_links":0,"defined_names":2,"comments":0,"pivot_tables":0},"unopened":[],"bounds":{"document_bytes":16777216,"sheet_cells":100000,"rows_first":2000,"rows_last":500,"rows_between":2000,"halvings":0,"cell_chars":16384,"cell_head_chars":4096},"cells_cut":0,"cells_raw":0,"read":"whole","date_system":"1900"}

{"sheet":"À LIRE EN PREMIER","index":0,"n_rows":65,"n_cols":6,"rows_kept":65,"cut":false,"hidden":false,"merged":[[12,1,12,6],[4,1,4,6],[38,1,38,6],[17,1,18,1],[17,2,18,4],[18,5,18,6],[19,2,19,4],[28,2,28,6],[29,2,29,6],[30,2,30,6],[17,5,17,6],[19,5,19,6],[20,5,20,6],[27,2,27,6],[33,1,33,6],[20,1,21,1],[1,1,1,6],[2,1,2,6],[10,1,10,6],[6,1,6,6],[8,1,8,6],[21,5,21,6],[20,2,21,4],[23,1,23,6],[25,1,25,6],[52,2,52,4],[41,5,41,6],[35,1,35,6],[40,5,40,6],[41,1,42,1],[41,2,42,4],[40,2,40,4],[42,5,42,6],[14,2,14,4],[14,5,14,6],[15,2,15,4],[16,2,16,4],[15,5,15,6],[16,5,16,6],[64,2,64,6],[60,2,60,6],[57,1,57,6],[54,2,54,4],[47,5,47,6],[48,5,48,6],[53,5,53,6],[54,5,54,6],[49,5,49,6],[48,2,48,4],[53,2,53,4],[61,2,61,6],[62,2,62,6],[50,5,50,6],[55,2,55,4],[55,5,55,6],[63,2,63,6],[43,2,43,4],[43,5,43,6],[51,2,51,4],[51,5,51,6],[49,2,49,4],[46,5,46,6],[44,2,44,4],[45,2,45,4],[46,2,46,4],[47,2,47,4],[45,5,45,6],[59,2,59,6],[50,2,50,4],[52,5,52,6],[44,5,44,6]]}
[null,"Outil d'aide à l'évaluation pour le passage au flacon de 5 doses de VAR"]
[null,"Veuillez adresser vos questions ou demandes d'assistance par courrier électronique à l'équipe responsable de l'évaluation du flacon de 5 doses de VAR de Linksbridge aux adresses suivantes : lena.stashko@linksbridge.com ; sheldon.halsted@linksbridge.com ; et/ou maggie.archbold@linksbridge.com"]
[null,"Présentation générale"]
[]
[null,"L'outil d'aide à l'évaluation pour le passage au flacon de 5 doses de VAR est un modèle simple permettant d'évaluer et de comparer les compromis programmatiques, financiers et logistiques entre les flacons de 5 doses et les flacons de 10 doses de VAR. Il vise à aider les décideurs au niveau national à comparer les produits et à estimer leur impact sur la couverture, le coût total des systèmes et les exigences en matière de chaîne du froid. L'outil peut être utilisé par tout pays désireux de comparer les flacons de VAR de 5 doses et ceux contenant 10 doses."]
[]
[null,"Avertissement : L'outil d'aide à l'évaluation du flacon de 5 doses a pour but d'éclairer la sélection des produits vaccinaux. Veuillez noter que les données disponibles sur l'impact des flacons de 5 doses de VAR sur les taux de perte vaccinale, la couverture et les coûts sont limitées ; veuillez ajuster les entrées, si nécessaire, de manière à tenir compte de cette incertitude. Ce modèle est destiné à donner un aperçu de l'impact potentiel de l'adoption des flacons de 5 doses et ne doit pas remplacer les prévisions détaillées ou la planification opérationnelle et budgétaire. "]
[]
[null,"Guide de l'utilisateur"]
[]
[null,"Inputs"]
[]
[null,"Dans la feuille de calcul Inputs, vous pouvez sélectionner le pays pour lequel vous souhaitez établir un modèle et les vaccins à comparer. Vous pouvez, en outre, ajuster les hypothèses concernant la couverture, la perte vaccinale et les coûts."]
[]
[null,"Catégorie","Description",null,null,"Sources"]
{"$rows_left_out":51}
{"sheet":"Inputs","index":1,"n_rows":40,"n_cols":9,"rows_kept":40,"cut":false,"hidden":false,"merged":[[6,8,6,9],[7,8,7,9],[5,8,5,9],[8,8,8,9],[9,8,9,9],[26,4,26,6],[11,1,11,6],[1,1,1,6],[24,1,24,6],[20,4,20,6],[21,4,21,6],[22,4,22,6],[2,1,2,6],[6,4,6,6],[7,4,7,6],[4,1,4,6],[16,4,16,6],[9,4,9,6],[8,4,8,6],[2,8,2,9],[39,1,39,9],[39,11,39,20],[36,8,36,9],[29,11,29,20],[31,11,31,20],[33,8,34,9],[35,8,35,9],[33,11,33,12],[29,1,29,9],[31,1,31,9],[27,4,27,6],[13,4,13,6],[14,4,14,6],[15,4,15,6],[18,1,18,6]]}
[null,"Outil d'aide à l'évaluation du passage au flacon de 5 doses de VAR - Inputs"]
[null,"Veuillez adresser vos questions ou demandes d'assistance par courrier électronique à l'équipe responsable de l'évaluation du flacon de 5 doses de VAR/VARR de Linksbridge aux adresses suivantes : lena.stashko@linksbridge.com ; sheldon.halsted@linksbridge.com ; et/ou maggie.archbold@linksbridge.com"]
[null,"ÉTAPE 1 : PROGRAMME DE VACCINATION"]
[]
[null,"Pays"]
[null,null,null,null,null,null,null,null,"Légende :"]
[null,"Sélectionnez le pays >>>","Afghanistan",null,"Pays analysé",null,null,null,"REQUIS : Sélectionnez l'entrée dans le menu déroulant."]
[null,"Taille de la population cible",{"$f":"VLOOKUP($C$7,'Country Data'!$B$3:$E$196,4,FALSE)","v":1368682},null,"PNUD, révision 2022, taille de la cohorte de naissance en 2022, renseignée automatiquement pour le pays listé comme référence",null,null,null,"Données renseignées automatiquement en fonction des entrées sélectionnées ou des données pré-renseignées. Vous pouvez écraser le contenu de ces cellules si vous souhaitez saisir vos propres données."]
[null,"Statut du cofinancement avec Gavi","Initial self-financing",null,"Statut de cofinancement avec Gavi du pays pour l'année de référence",null,null,null,"Les entrées qui ont été saisies manuellement sont surlignées en jaune."]
[null,"Part de cofinancement du pays",1,null,"Le pourcentage du prix du vaccin par dose ou « fraction de prix » dont le pays est responsable. Les pays ne bénéficiant pas du soutien de Gavi doivent entrer 100 % pour toutes les années.",null,null,null,"AVERTISSEMENT : Si vous avez ajusté manuellement une cellule d'entrée, vous pouvez cliquer sur le bouton RESET pour restaurer les données renseignées automatiquement."]
[]
[null,"Couverture"]
[]
[null,"Couverture du VAR1",{"$f":"VLOOKUP($C$7,'Country Data'!$B$3:$D$196,2,FALSE)","v":0.63},null,"Données WUENIC 2022, couverture du VAR1 en 2021, renseignée automatiquement pour le pays listé comme référence"]
[null,"Couverture du VAR2",{"$f":"VLOOKUP($C$7,'Country Data'!$B$3:$D$196,3,FALSE)","v":0.44},null,"Données WUENIC 2022, couverture du VAR2 en 2021, renseignée automatiquement pour le pays listé comme référence"]
{"$rows_left_out":26}
{"sheet":"Résultats","index":2,"n_rows":48,"n_cols":15,"rows_kept":48,"cut":false,"hidden":false,"merged":[[44,1,44,2],[39,1,39,2],[40,1,40,2],[41,1,41,2],[42,1,42,2],[43,1,43,2],[21,1,21,2],[28,1,30,1],[33,11,33,12],[33,14,33,15],[32,1,33,1],[29,11,29,12],[29,14,29,15],[30,11,30,12],[30,14,30,15],[7,1,7,2],[8,1,8,2],[9,1,9,2],[10,1,10,2],[11,1,11,2],[38,14,40,15],[39,8,39,9],[39,5,39,6],[38,8,38,9],[23,1,23,15],[38,5,38,6],[38,11,40,12],[25,5,25,6],[25,8,25,9],[25,11,27,12],[25,14,27,15],[26,1,26,2],[26,5,26,6],[26,8,26,9],[27,1,27,2],[47,1,47,15],[16,5,16,6],[6,8,6,9],[7,8,7,9],[16,8,16,9],[17,5,17,6],[17,8,17,9],[43,11,43,12],[43,14,43,15],[44,11,44,12],[44,14,44,15],[28,11,28,12],[28,14,28,15],[41,11,41,12],[41,14,41,15],[42,11,42,12],[42,14,42,15],[31,11,31,12],[31,14,31,15],[1,1,1,8],[10,11,10,12],[11,11,11,12],[9,14,9,15],[10,14,10,15],[11,14,11,15],[9,11,9,12],[2,1,2,15],[4,1,4,15],[6,5,6,6],[7,5,7,6],[6,11,8,12],[6,14,8,15],[14,1,14,15],[32,11,32,12],[32,14,32,15],[36,1,36,15],[21,11,21,12],[21,14,21,15],[19,11,19,12],[19,14,19,15],[20,11,20,12],[20,14,20,15],[16,11,18,12],[16,14,18,15],[17,1,17,2],[18,1,18,2],[19,1,19,2],[20,1,20,2]]}
[null,"Outil d'aide à la décision pour le passage au flacon de 5 dose de VAR - Résultats (annuels)"]
[null,"Veuillez adresser vos questions ou demandes d'assistance par courrier électronique à l'équipe responsable de l'évaluation du flacon de 5 doses de VAR/VARR de Linksbridge aux adresses suivantes : lena.stashko@linksbridge.com ; sheldon.halsted@linksbridge.com ; et/ou maggie.archbold@linksbridge.com"]
[null,{"$f":"_xlfn.CONCAT(\"RÉSULTATS: \",UPPER(Inputs!C7))","v":"RÉSULTATS: AFGHANISTAN"}]
[]
[null,"LIVRAISON DES VACCINS"]
[]
[null,null,null,"PRODUIT ACTUEL EN FLACON DE 10 DOSES",null,"OPTION 1\n(FLACON À 5 DOSES)",null,null,"OPTION 2\n(FLACON À 5 DOSES)",null,null,"Description",null,null,"Interprétation"]
[null,{"$f":"VLOOKUP($C$7,'Country Data'!$B$3:$E$196,4,FALSE)","v":{"$error":"#N/A"}},null,{"$f":"Inputs!$C$35","v":"RR, Bio E\nFlacon de 10 doses"},null,{"$f":"Inputs!$E$35","v":"RR, SII\n Flacon à 5 doses"},null,null,{"$f":"Inputs!$G$35","v":"RR, BioE\nFlacon à 5 doses"}]
[null,"Résultats et différence",null,"Résultats",null,"Résultats","Différence (5 doses - 10 doses)",null,"Résultats","Différence (5 doses - 10 doses)"]
[null,"Approvisionnement total nécessaire",null,{"$f":"(Inputs!$C$8*Inputs!$C$14*(1/(1-Inputs!$C$22)))+(Inputs!$C$8*Inputs!$C$15*(1/(1-Inputs!$C$22)))","v":2108089.4486828847},null,{"$f":"(Inputs!$C$8*(Inputs!$C$14+Inputs!$C$16)*(1/(1-Inputs!$C$23)))+(Inputs!$C$8*(Inputs!$C$15+Inputs!$C$17)*(1/(1-Inputs!$C$23)))","v":1883176.4545635884},{"$f":"F10-D10","v":-224912.99411929632},null,{"$f":"(Inputs!$C$8*(Inputs!$C$14+Inputs!$C$16)*(1/(1-Inputs!$C$23)))+(Inputs!$C$8*(Inputs!$C$15+Inputs!$C$17)*(1/(1-Inputs!$C$23)))","v":1883176.4545635884},{"$f":"I10-D10","v":-224912.99411929632},null,"La demande en vaccins VAR, compte tenu de la population cible, du nombre de doses, de la couverture et des taux de perte vaccinale",null,null,{"$f":"(_xlfn.CONCAT(\"L'approvisionnement total nécessaire diminuera de \",TEXT(ABS(D10-F10),\"###,###,###\"),\" doses par an, ou de \",TEXT(ABS(((D10-F10)/D10)),\"0 %\")))","v":"L'approvisionnement total nécessaire diminuera de 224,913 doses par an, ou de 11 %"}]
[null,"Nombre de doses administrées",null,{"$f":"(Inputs!$C$8*Inputs!$C$14)+(Inputs!$C$8*Inputs!$C$15)","v":1464489.74},null,{"$f":"(Inputs!$C$8*(Inputs!$C$14+Inputs!$C$16))+(Inputs!$C$8*(Inputs!$C$15+Inputs!$C$17))","v":1578478.5042152},{"$f":"F11-D11","v":113988.76421519998},null,{"$f":"(Inputs!$C$8*(Inputs!$C$14+Inputs!$C$16))+(Inputs!$C$8*(Inputs!$C$15+Inputs!$C$17))","v":1578478.5042152},{"$f":"I11-D11","v":113988.76421519998},null,"Le nombre de doses administrées aux enfants, y compris le VAR1 et le VAR2.",null,null,{"$f":"IF(F11-D11=0,\"La couverture de base du VAR1 et du VAR2 étant supérieure à 95 %, cette analyse suppose qu'il n'y a pas d'augmentation de la couverture ou du nombre d'enfants vaccinés suite à l'adoption des flacons de 5 doses\",(_xlfn.CONCAT(\"Les \",TEXT(ABS(F11-D11),\"###,###,###\"),\" doses supplémentaires seront administrées chaque année (y compris le VAR1 et le VAR2), ce qui représente une augmentation de \",TEXT(ABS(((D11-F11)/D11)),\"0 %\"))))","v":"Les 113,989 doses supplémentaires seront administrées chaque année (y compris le VAR1 et le VAR2), ce qui représente une augmentation de 8 %"}]
[null,"Nombre de doses gaspillées",null,{"$f":"D10-D11","v":643599.7086828847},null,{"$f":"F10-F11","v":304697.9503483884},{"$f":"F12-D12","v":-338901.75833449629},null,{"$f":"I10-I11","v":304697.9503483884},{"$f":"I12-D12","v":-338901.75833449629},null,"Le nombre de doses perdues par rapport à l'approvisionnement total nécessaire, sur la base des taux de perte vaccinale",null,null,{"$f":"(_xlfn.CONCAT(\"Le nombre de doses perdues \",IF(F12<D12,\"diminuera \",\"augmentera \"),\"de \",TEXT(ABS(F12-D12),\"###,###,###\"),\" doses environ, ou de \",TEXT(ABS(((D12-F12)/D12)),\"0 %\")))","v":"Le nombre de doses perdues diminuera de 338,902 doses environ, ou de 53 %"}]
[]
[]
[null,"COÛT TOTAL DES SYSTÈMES (PAR ENFANT VACCINÉ)"]
{"$rows_left_out":34}
{"sheet":"Impact","index":3,"n_rows":41,"n_cols":4,"rows_kept":41,"cut":false,"hidden":false,"merged":[[39,3,39,14],[40,3,40,14],[31,1,31,14],[33,1,33,14],[34,1,34,14],[36,1,36,14],[37,1,37,14],[38,3,38,14],[30,1,30,14],[22,1,22,14],[24,1,24,14],[25,1,25,14],[27,1,27,14],[28,1,28,14],[17,1,17,14],[18,1,18,14],[19,1,19,14],[11,1,11,14],[12,1,12,14],[13,1,13,14],[14,1,14,14],[7,1,7,14],[8,1,8,14],[1,1,1,7],[2,1,2,14],[4,1,4,14],[5,1,5,14],[6,1,6,14]]}
[null,"Outil d'aide à l'évaluation pour le passage au flacon de 5 doses de VAR - Résultats (annuels)"]
[null,"Veuillez adresser vos questions ou demandes d'assistance par courrier électronique à l'équipe responsable de l'évaluation du flacon de 5 doses de VAR/VARR de Linksbridge aux adresses suivantes : lena.stashko@linksbridge.com ; sheldon.halsted@linksbridge.com ; et/ou maggie.archbold@linksbridge.com"]
[null,{"$f":"_xlfn.CONCAT(\"IMPACT: \",UPPER(Inputs!$C$7))","v":"IMPACT: AFGHANISTAN"}]
[]
[null,"LIVRAISON DES VACCINS"]
[null,{"$f":"_xlfn.CONCAT(\"PRINCIPAUX POINTS À RETENIR DE L'OPTION 1 : L'adoption des flacons de 5 doses entraîne une réduction de l'approvisionnement total nécessaire\",IF(Résultats!F11=Résultats!D11,\"\",\", supplémentaires d'enfants vaccinés,\"),\" et moins de doses perdues qu'avec les flacons de 10 doses\")","v":"PRINCIPAUX POINTS À RETENIR DE L'OPTION 1 : L'adoption des flacons de 5 doses entraîne une réduction de l'approvisionnement total nécessaire, supplémentaires d'enfants vaccinés, et moins de doses perdues qu'avec les flacons de 10 doses"}]
[null,{"$f":"(_xlfn.CONCAT(\"L'approvisionnement total nécessaire diminuera de \",TEXT(ABS(Résultats!D10-Résultats!F10),\"###,###,###\"),\" doses chaque année, ou de \",TEXT(ABS(((Résultats!D10-Résultats!F10)/Résultats!D10)),\"0%\")))","v":"L'approvisionnement total nécessaire diminuera de 224,913 doses chaque année, ou de 11%"}]
[null,{"$f":"IF(Résultats!D11-Résultats!F11=0,\"La couverture de base du VAR1 et du VAR2 étant supérieure à 95 %, cette analyse suppose qu'il n'y a pas d'augmentation de la couverture ou du nombre d'enfants vaccinés suite à l'adoption des flacons de 5 doses\",_xlfn.CONCAT(\"\",TEXT(ABS(Résultats!D11-Résultats!F11),\"###,###,###\"),\" doses supplémentaires seront administrées chaque année (y compris le VAR1 et le VAR2), ce qui représente une augmentation de \",TEXT(ABS(((Résultats!D11-Résultats!F11)/Résultats!D11)),\"0 %\")))","v":"113,989 doses supplémentaires seront administrées chaque année (y compris le VAR1 et le VAR2), ce qui représente une augmentation de 8 %"}]
[null,{"$f":"_xlfn.CONCAT(\"Le nombre de doses perdues \",IF(Résultats!F12<Résultats!D12,\"diminuera \",\"augmentera \"),\"de \",TEXT(ABS(Résultats!F12-Résultats!D12),\"###,###,###\"),\" doses environ, ou de \",TEXT(ABS(((Résultats!D12-Résultats!F12)/Résultats!D12)),\"0 %\"))","v":"Le nombre de doses perdues diminuera de 338,902 doses environ, ou de 53 %"}]
[]
[]
[null,"COÛT TOTAL DES SYSTÈMES"]
[null,{"$f":"_xlfn.CONCAT(\"PRINCIPAUX POINTS À RETENIR DE L'OPTION 1 : \",IF(Résultats!F21> Résultats!D21,\"Compte tenu de la perte vaccinale et de la couverture, le coût de l'approvisionnement en vaccins est marginalement plus élevé pour les flacons de 5 doses\",\"Compte tenu des pertes et de la couverture, le coût de l'approvisionnement en vaccins est moins cher pour les flacons de 5 doses que pour ceux de 10 doses\"),\". Outre le coût de l'approvisionnement en vaccins, \",Inputs!C7,\" doit également tenir compte des coûts marginaux non liés aux vaccins associés à l'adoption des flacons de 5 doses. Les coûts associés au changement peuvent être compensés par une subvention de Gavi pour le changement de produit, en cas d'éligibilité.\")","v":"PRINCIPAUX POINTS À RETENIR DE L'OPTION 1 : Compte tenu de la perte vaccinale et de la couverture, le coût de l'approvisionnement en vaccins est marginalement plus élevé pour les flacons de 5 doses. Outre le coût de l'approvisionnement en vaccins, Afghanistan doit également tenir compte des coûts marginaux non liés aux vaccins associés à l'adoption des flacons de 5 doses. Les coûts associés au changement peuvent être compensés par une subvention de Gavi pour le changement de produit, en cas d'éligibilité."}]
[null,{"$f":"(_xlfn.CONCAT(\"Le coût total de l'approvisionnement en vaccins pour \",Inputs!C7,\" sera environ de  \",TEXT(Résultats!F29,\"$###,###,###\"),\", soit de  \",IF(Résultats!F29>Résultats!D29,_xlfn.CONCAT(TEXT(ABS(Résultats!F29-Résultats!D29),\"$###,###,###\"),\" plus\"),_xlfn.CONCAT(TEXT(ABS(Résultats!F29-Résultats!D29),\"$###,###,###\"),\" moins\")),\" cher pour les flacons de 5 doses que pour ceux de 10 doses, compte tenu d'un potentiel cofinancement\"))","v":"Le coût total de l'approvisionnement en vaccins pour Afghanistan sera environ de  $2,052,662, soit de  $383,055 plus cher pour les flacons de 5 doses que pour ceux de 10 doses, compte tenu d'un potentiel cofinancement"}]
[null,{"$f":"(_xlfn.CONCAT(\"Le coût total pour \",Inputs!C7,\", compte tenu des coûts marginaux non liés aux vaccins pour les flacons de 5 doses sera environ de \",TEXT(Résultats!F33,\"$###,###,###\"),\", soit de \",IF(Résultats!F33>Résultats!D33,_xlfn.CONCAT(TEXT(ABS(Résultats!F33-Résultats!D33),\"$###,###,###\"),\" plus\"),_xlfn.CONCAT(TEXT(ABS(Résultats!F33-Résultats!D33),\"$###,###,###\"),\" moins\")),\" cher pour les flacons de 5 doses que pour ceux de 10 doses\"))","v":"Le coût total pour Afghanistan, compte tenu des coûts marginaux non liés aux vaccins pour les flacons de 5 doses sera environ de $2,226,295, soit de $556,688 plus cher pour les flacons de 5 doses que pour ceux de 10 doses"}]
{"$rows_left_out":27}
{"sheet":"Données de couverture","index":4,"n_rows":102,"n_cols":3,"rows_kept":102,"cut":false,"hidden":true,"merged":[]}
["Coverage Data"]
["Couverture de base","Augmentation de la couverture du VAR1","Augmentation de la couverture du VAR2"]
[0.01,4.9000000000000002E-2,3.5000000000000003E-2]
[0.02,4.9000000000000002E-2,3.5000000000000003E-2]
[0.03,4.9000000000000002E-2,3.5000000000000003E-2]
[0.04,4.9000000000000002E-2,3.5000000000000003E-2]
[0.05,4.9000000000000002E-2,3.5000000000000003E-2]
[0.06,4.9000000000000002E-2,3.5000000000000003E-2]
[7.0000000000000007E-2,4.9000000000000002E-2,3.5000000000000003E-2]
[0.08,4.9000000000000002E-2,3.5000000000000003E-2]
[0.09,4.9000000000000002E-2,3.5000000000000003E-2]
[0.1,4.9000000000000002E-2,3.5000000000000003E-2]
[0.11,4.9000000000000002E-2,3.5000000000000003E-2]
[0.12,4.9000000000000002E-2,3.5000000000000003E-2]
[0.13,4.9000000000000002E-2,3.5000000000000003E-2]
{"$rows_left_out":88}
{"sheet":"Country Data","index":5,"n_rows":196,"n_cols":5,"rows_kept":196,"cut":false,"hidden":true,"merged":[]}
["Country Data (coverage & birth cohort size)"]
["Code_ISO","Pays","Couverture du VAR1 (2021)","Couverture du VAR2 (2021)","Cohorte de naissances (2022)"]
["AFG","Afghanistan",0.63,0.44,1368682]
["ZAF","Afrique du Sud",0.87,0.82,1161080]
["ALB","Albanie",0.87,0.92,28218.5]
["DZA","Algérie",0.8,0.77,946304.5]
["DEU","Allemagne",0.97,0.93,764994]
["AND","Andorre",{"$f":"VLOOKUP($C$7,'Country Data'!$B$3:$E$196,4,FALSE)","v":{"$error":"#N/A"}},0.97,335.5]
["ATG","Antigua",0.85,0.76,1123.5]
["SAU","Arabie saoudite",0.98,0.97,637710]
["ARG","Argentina",0.81,0.79,627545]
["AUS","Australie",0.93,0.94,298603]
["AUT","Austriche",0.95,0.88,84112.5]
["BHS","Bahamas",0.82,0.82,4631]
["BHR","Bahreïn",0.99,0.99,17818]
{"$rows_left_out":182}
{"sheet":"Données sur le taux de perte","index":6,"n_rows":5,"n_cols":4,"rows_kept":5,"cut":false,"hidden":true,"merged":[]}
["Données sur le taux de perte"]
["Gaspillage","10 doses","5 doses","Commentaires"]
["Fiche d'information OMS/UNICEF",0.4,0.3,"Hypothèses sur la perte vaccinale tirées de la fiche d'information OMS/UNICEF sur les présentations de vaccin R/RR en flacons de cinq doses"]
["Étude sur la Zambie",0.30530000000000002,0.1618,"Résultats de l'étude sur la perte vaccinale en Zambie"]
["Saisie manuelle d'hypothèses sur la perte vaccinale enter wastage assumptions","Saisie manuelle enter","Saisie manuelle enter","Saisissez vos propres hypothèses sur la perte vaccinale pour la taille de flacon indiquée"]

{"sheet":"Coûts programmatiques","index":7,"n_rows":4,"n_cols":3,"rows_kept":4,"cut":false,"hidden":true,"merged":[]}
["Coûts programmatique"]
["Gaspillage","Coût marginal non lié aux vaccins Non-Vaccine Cost","Commentaires"]
["Étude sur la Zambie",0.11,"L'étude sur la Zambie a révélé que le coût marginal économique et financier par flacon de 5 doses administré était de 0,11 $ (hors coût du vaccin). Les coûts supplémentaires comprennent les coûts de la chaîne du froid, du transport, de la sensibilisation, des ressources humaines et de l'élimination des déchets. Les données proviennent du rapport du DPCP sur la Zambie."]
["Saisie manuelle des coûts du programme ","Saisie manuelle","Saisissez vos propres hypothèses de coûts programmatiques associés à l'adoption des flacons de 5 doses. Il s'agit des coûts marginaux non liés aux vaccins par dose administrée. Ces coûts comprennent les coûts de la chaîne du froid, du transport, de la sensibilisation, des ressources humaines et de l'élimination des déchets."]

{"sheet":"Données sur le produit","index":8,"n_rows":11,"n_cols":3,"rows_kept":11,"cut":false,"hidden":true,"merged":[]}
["Données sur le produit"]
["Vaccin","Prix par dose (UNICEF, 2023)","Volume de chaîne du froid par dose (en cm3)"]
["Rougeole, SII\n Flacon de 10 doses",0.42299999999999999,{"$f":"2.11+3.14","v":5.25}]
["Rougeole, Bio Farma\n Flacon de 10 doses",0.27,{"$f":"3.3+2.53","v":5.83}]
["RR, SII\n Flacon de 10 doses",0.873,{"$f":"2.1+3.14","v":5.24}]
["RR, Bio E\nFlacon de 10 doses",0.79200000000000004,{"$f":"1.78+2.12","v":3.9000000000000004}]
["ROR, SII\n Flacon de 10 doses",1.7090000000000001,{"$f":"SUM(2.109+3.1424)","v":5.2514000000000003}]
["Rougeole, SII\nFlacon à 5 doses",0.52200000000000002,{"$f":"3.16+5.48","v":8.64}]
["RR, SII\n Flacon à 5 doses",1.0900000000000001,{"$f":"3.16+5.49","v":8.65}]
["RR, BioE\nFlacon à 5 doses",0.91800000000000004,{"$f":"2.67+3.25","v":5.92}]
["ROR, SII\n Flacon à 5 doses",1.776,{"$f":"4.218+5.481","v":9.6989999999999998}]

{"sheet":"Co-financement Gavi","index":9,"n_rows":6,"n_cols":1,"rows_kept":6,"cut":false,"hidden":true,"merged":[]}
["Statut du cofinancement avec Gavi"]
["Auto-financement initial"]
["Transition préparatoire"]
["Transition accélérée"]
["Pays ayant transité hors du soutien de Gavi"]
["Pays ne bénéficiant pas du soutien de Gavi"]